{"text_format":"1","workbook":"xlsx","n_sheets":5,"sheets":["{PH List}","Input_Output","Input_Prijsindex","Calc","FinResBedr"],"not_rendered":{"charts":0,"images":1,"macros":1,"external_links":1,"defined_names":76,"comments":3,"pivot_tables":0},"unopened":[],"bounds":{"document_bytes":16777216,"sheet_cells":100000,"rows_first":2000,"rows_last":500,"rows_between":2000,"halvings":0,"cell_chars":16384,"cell_head_chars":4096},"cells_cut":0,"cells_raw":0,"read":"whole","date_system":"1900"}

{"sheet":"{PH List}","index":0,"n_rows":22,"n_cols":7,"rows_kept":22,"cut":false,"hidden":true,"merged":[]}
[{"$f":" RIGHT(CELL(\"filename\", A1), LEN(CELL(\"filename\", A1)) - SEARCH(\"]\", CELL(\"filename\", A1)))","v":"{PH List}"}]
[]
[]
[null,null,null,"Date","Description","Link","Reference"]
[]
["Input_Output"]
[null,null,null,"2012-10-30","Temporary Placeholder",{"$f":"Input_Output!#REF!","v":{"$error":"#REF!"}},"Input_Output!$E$12"]
[null,null,null,"2012-10-30","Temporary Placeholder",{"$f":"Input_Output!$E$43","v":"Levensduur te vervangen onderdeel"},"Input_Output!$E$54"]
[]
["Calc"]
[null,null,null,"2012-10-30","Temporary Placeholder",{"$f":"Calc!$E$22","v":0},"Calc!$E$22"]
[null,null,null,"2012-10-30","Temporary Placeholder",{"$f":"Calc!$E$40","v":0},"Calc!$E$40"]
[null,null,null,"2012-10-30","Temporary Placeholder",{"$f":"Calc!$E$98","v":0},"Calc!$E$98"]
[null,null,null,"2012-10-30","Temporary Placeholder",{"$f":"Calc!$E$149","v":"Opbrengst OT (GS)"},"Calc!$E$154"]
[null,null,null,"2012-10-30","Temporary Placeholder",{"$f":"Calc!$E$153","v":0},"Calc!$E$158"]
[null,null,null,"2012-10-30","Temporary Placeholder",{"$f":"Calc!$E$169","v":"Opbrengst OT (WKK)"},"Calc!$E$172"]
[null,null,null,"2012-10-30","Temporary Placeholder",{"$f":"Calc!$E$173","v":0},"Calc!$E$176"]
[null,null,null,"2012-10-30","Temporary Placeholder",{"$f":"Calc!$E$264","v":"Afschrijvingen POS"},"Calc!$E$270"]
[null,null,null,"2012-10-30","Temporary Placeholder",{"$f":"Calc!$E$339","v":0},"Calc!$E$345"]
[null,null,null,"2012-10-30","Temporary Placeholder",{"$f":"Calc!$E$347","v":0},"Calc!$E$353"]
[]
["FinResBedr"]

{"sheet":"Input_Output","index":1,"n_rows":115,"n_cols":27,"rows_kept":115,"cut":false,"hidden":false,"merged":[[2,5,2,6]]}
["Onrendabele Topberekening"]
[{"$f":"F3","v":"Fictieve voorbeeldberekening"}]
[null,null,null,null,"Actieve inputkolom","Fictieve voorbeeldberekening",null,{"$f":" MATCH($F3, I3:Y3, FALSE)","v":2},null,"Fictieve voorbeeldberekening","Installatie categorie 2","Installatie categorie 3","Installatie categorie 4",",,,"]
[null,null,null,null,null,"Constante","Eenheid"]
["Outputs"]
[null,null,"Onrendabele Top (basis productie groene stroom)"]
[null,null,null,null,{"$f":"Calc!E509","v":"Onrendabele Top Projectfinanciering"},{"$f":"IF(F17=\"WKB\",\"n.v.t.\",Calc!F509)","v":234.81225290023013},{"$f":"Calc!G509","v":"Euro/MWh"}]
[null,null,null,null,{"$f":" Calc!E$515","v":"Check rendement Project na belastingen Projectfinanciering"},{"$f":"Calc!F$515","v":1},{"$f":" Calc!G$515","v":"Check"}]
[null,null,"Onrendabele Top (basis warmtekrachtbesparing)"]
[null,null,null,null,{"$f":"Calc!E510","v":"Onrendabele Top Projectfinanciering"},{"$f":"IF(F17=\"GS productie\",\"n.v.t.\",Calc!F510)","v":"n.v.t."},{"$f":"Calc!G510","v":"Euro/MWh"}]
[null,null,null,null,{"$f":"Calc!E$516","v":"Check rendement Project na belastingen Projectfinanciering"},{"$f":"Calc!F$516","v":1},{"$f":"Calc!G$516","v":"Check"}]
[null,null,null,null,"Run macro \"goalseek\" om OT obv Projectfinanciering te berekenen"]
[]
["Inputs"]
[]
[null,null,"Algemeen"]
[null,null,null,null,"OT obv GS productie of WKB?",{"$f":" INDEX(I17:Y17, $H$3)","v":"GS productie"},"GS productie/WKB",null,null,"GS productie"]
[null,null,null,null,"Particulier of bedrijf?","bedr","part/bedr"]
[]
[null,null,"Productie groene stroom"]
[null,null,null,null,"Eenheid van unit grootte",{"$f":" INDEX(I21:Y21, $H$3)","v":"kWe"},"kWe of kWth",null,null,"kWe"]
[null,null,null,null,"Unit grootte",5,{"$f":"F21","v":"kWe"},null,null,5]
[null,null,null,null,"Unit grootte elektriciteitsdeel",5,"kWe",null,null,5]
[null,null,null,null,"Bedrijfstijd/vollasturen",850,"Uren/jaar",null,null,850]
[null,null,null,null,"Economische levensduur",15,"Jaar",null,null,15]
[null,null,null,null,"Elektrisch rendement",0.4,"[%]",null,null,0.4]
[]
[null,null,"WKK"]
[null,null,null,null,"Thermisch rendement WKK",{"$f":" INDEX(I29:Y29, $H$3)","v":0},"[%]",null,null,0]
[null,null,null,null,"Referentierendement WKK Vla (thermisch)",0,"[%]",null,null,0]
{"$rows_left_out":86}
{"sheet":"Input_Prijsindex","index":2,"n_rows":117,"n_cols":40,"rows_kept":117,"cut":false,"hidden":false,"merged":[]}
[{"$f":"Input_Output!A1","v":"Onrendabele Topberekening"}]
[]
[null,null,null,null,null,null,null,null,null,"Jaar"]
[null,null,null,null,null,"Constante","Eenheid","Totaal",null,{"$f":"J9","v":0},{"$f":"K9","v":1},2,3,4,5,6,7,8,9,10,11,12,13,14,15,16,17,18,19,20,21,22,23,24,25,26,27,28,29,30]
[]
["Prijsindex"]
[]
[null,"Jaartallen"]
[null,null,null,null,"Jaar",null,"Volgnr",null,null,0,{"$f":" J9 +1","v":1},2,3,4,5,6,7,8,9,10,11,12,13,14,15,16,17,18,19,20,21,22,23,24,25,26,27,28,29,30]
[]
[null,"Jaarlijkse prijsevolutie geïntegreerd in de OT berekening"]
[]
[null,null,null,null,{"$f":"E$9","v":"Jaar"},{"$f":"F$9","v":0},"Volgnr",0,0,0,1,2,3,4,5,6,7,8,9,10,11,12,13,14,15,16,17,18,19,20,21,22,23,24,25,26,27,28,29,30]
[null,null,null,null,"Elektriciteit productiekost",null,"[%]",null,0.05,0,0.02,{"$f":"$K14","v":0.02},{"$f":"$K14","v":0.02},0.02,0.02,0.02,0.02,0.02,0.02,0.02,0.02,0.02,0.02,0.02,0.02,0.02,0.02,0.02,0.02,0.02,0.02,0.02,0.02,0.02,0.02,0.02,0.02,0.02,0.02,0.02]
[null,null,null,null,"Elektriciteit eindverbruiker",null,"[%]",null,3.5000000000000003E-2,0,3.5000000000000003E-2,3.5000000000000003E-2,{"$f":"$K15","v":3.5000000000000003E-2},3.5000000000000003E-2,3.5000000000000003E-2,3.5000000000000003E-2,3.5000000000000003E-2,3.5000000000000003E-2,3.5000000000000003E-2,3.5000000000000003E-2,3.5000000000000003E-2,3.5000000000000003E-2,3.5000000000000003E-2,3.5000000000000003E-2,3.5000000000000003E-2,3.5000000000000003E-2,3.5000000000000003E-2,3.5000000000000003E-2,3.5000000000000003E-2,3.5000000000000003E-2,3.5000000000000003E-2,3.5000000000000003E-2,3.5000000000000003E-2,3.5000000000000003E-2,3.5000000000000003E-2,3.5000000000000003E-2,3.5000000000000003E-2,3.5000000000000003E-2,3.5000000000000003E-2,3.5000000000000003E-2]
[null,null,null,null,"Aardgas",null,"[%]",null,5.7000000000000002E-2,0,3.5000000000000003E-2,3.5000000000000003E-2,3.5000000000000003E-2,3.5000000000000003E-2,3.5000000000000003E-2,3.5000000000000003E-2,3.5000000000000003E-2,3.5000000000000003E-2,3.5000000000000003E-2,3.5000000000000003E-2,3.5000000000000003E-2,3.5000000000000003E-2,3.5000000000000003E-2,3.5000000000000003E-2,3.5000000000000003E-2,3.5000000000000003E-2,3.5000000000000003E-2,3.5000000000000003E-2,3.5000000000000003E-2,3.5000000000000003E-2,3.5000000000000003E-2,3.5000000000000003E-2,3.5000000000000003E-2,3.5000000000000003E-2,3.5000000000000003E-2,3.5000000000000003E-2,3.5000000000000003E-2,3.5000000000000003E-2,3.5000000000000003E-2,3.5000000000000003E-2]
[null,null,null,null,"Steenkool",null,"[%]",null,0.06,0,0,0,0,0,0,0,0,0,0,0,0,0,0,0,0,0,0,0,0,0,0,0,0,0,0,0,0,0,0,0]
[null,null,null,null,"Dierlijk vet",null,"[%]",null,0.05,0,0,0,0,0,0,0,0,0,0,0,0,0,0,0,0,0,0,0,0,0,0,0,0,0,0,0,0,0,0,0]
[null,null,null,null,"Pellets",null,"[%]",null,0.05,0,0,0,0,0,0,0,0,0,0,0,0,0,0,0,0,0,0,0,0,0,0,0,0,0,0,0,0,0,0,0]
[null,null,null,null,"Houtchips",null,"[%]",null,7.6999999999999999E-2,0,1.0999999999999999E-2,1.0999999999999999E-2,1.0999999999999999E-2,1.0999999999999999E-2,1.0999999999999999E-2,1.0999999999999999E-2,1.0999999999999999E-2,1.0999999999999999E-2,1.0999999999999999E-2,1.0999999999999999E-2,1.0999999999999999E-2,1.0999999999999999E-2,1.0999999999999999E-2,1.0999999999999999E-2,1.0999999999999999E-2,1.0999999999999999E-2,1.0999999999999999E-2,1.0999999999999999E-2,1.0999999999999999E-2,1.0999999999999999E-2,1.0999999999999999E-2,1.0999999999999999E-2,1.0999999999999999E-2,1.0999999999999999E-2,1.0999999999999999E-2,1.0999999999999999E-2,1.0999999999999999E-2,1.0999999999999999E-2,1.0999999999999999E-2,1.0999999999999999E-2]
[null,null,null,null,"Kost OBA",null,"[%]",null,0.02,0,0,0,0,0,0,0,0,0,0,0,0,0,0,0,0,0,0,0,0,0,0,0,0,0,0,0,0,0,0,0]
[null,null,null,null,"Mest-energieteelt",null,"[%]",null,0.02,0,0,0,0,0,0,0,0,0,0,0,0,0,0,0,0,0,0,0,0,0,0,0,0,0,0,0,0,0,0,0]
[null,null,null,null,"Opbrengst GFT",null,"[%]",null,-0.02,0,0,0,0,0,0,0,0,0,0,0,0,0,0,0,0,0,0,0,0,0,{"$f":"$K23","v":0},0,0,0,0,0,0,0,0,0]
[null,null,null,null,"Kost afzet digestaat mest-energieteelt",null,"[%]",null,0.02,0,0,0,0,0,0,0,0,0,0,0,0,0,0,0,0,0,0,0,0,0,0,0,0,0,0,0,0,0,0,0]
[null,null,null,null,"Kost afzet digestaat OBA",null,"[%]",null,0.02,0,0,0,0,0,0,0,0,0,0,0,0,0,0,0,0,0,0,0,0,0,0,0,0,0,0,0,0,0,0,0]
[null,null,null,null,"O&M kosten",null,"[%]",null,0.02,0,0.02,0.02,0.02,0.02,0.02,0.02,0.02,0.02,0.02,0.02,0.02,0.02,0.02,0.02,0.02,0.02,0.02,0.02,0.02,0.02,0.02,0.02,0.02,0.02,0.02,0.02,0.02,0.02,0.02,0.02]
[null,null,null,null,0,null,"[%]",null,null,0,null,0,0,0,0,0,0,0,0,0,0,0,0,0,0,0,0,0,0,0,0,0,0,0,0,0,0,0,0,0]
[]
[null,"Jaarlijkse prijsindex geïntegreerd in de OT berekening"]
[]
{"$rows_left_out":88}
{"sheet":"Calc","index":3,"n_rows":547,"n_cols":256,"rows_kept":547,"cut":false,"hidden":false,"merged":[]}
[{"$f":"Input_Output!A1","v":"Onrendabele Topberekening"}]
[{"$f":"Input_Output!F3","v":"Fictieve voorbeeldberekening"}]
[null,null,null,null,null,null,null,null,null,"Jaar"]
[null,null,null,null,null,"Constante","Eenheid","Totaal",null,{"$f":" J9","v":0},1,2,3,4,5,6,7,8,9,10,11,12,13,14,15,16,17,18,19,20,21,22,23,24,25,26,27,28,29,30]
[]
["Algemeen"]
[]
[null,"Jaartallen"]
[null,null,null,null,"Jaar",null,"Volgnr",null,null,0,{"$f":" J9 +1","v":1},{"$f":" K9 +1","v":2},3,4,5,6,7,8,9,10,11,12,13,14,15,16,17,18,19,20,21,22,23,24,25,26,27,28,29,30]
[]
[null,"Constructieperiode"]
[null,null,null,null,{"$f":" Input_Output!E$95","v":"Constructieperiode"},{"$f":" Input_Output!F$95","v":1},{"$f":" Input_Output!G$95","v":"Jaar"}]
[null,null,null,null,{"$f":" E$9","v":"Jaar"},{"$f":" F$9","v":0},"Volgnr",0,0,0,1,2,3,4,5,6,7,8,9,10,11,12,13,14,15,16,17,18,19,20,21,22,23,24,25,26,27,28,29,30]
[null,null,null,null,"Constructieperiode Vlag",null,"Vlag",{"$f":" SUM(J14:AN14)","v":1},null,{"$f":" IF( J13 < $F12, 1, 0)","v":1},{"$f":" IF( K13 < $F12, 1, 0)","v":0},0,0,0,0,0,0,0,0,0,0,0,0,0,0,0,0,0,0,0,0,0,0,0,0,0,0,0,0,0]
[]
[null,"Economische levensduur"]
[null,null,null,null,{"$f":" Input_Output!E$25","v":"Economische levensduur"},{"$f":" Input_Output!F$25","v":15},{"$f":" Input_Output!G$25","v":"Jaar"}]
[null,null,null,null,{"$f":" Input_Output!E$95","v":"Constructieperiode"},{"$f":" Input_Output!F$95","v":1},{"$f":" Input_Output!G$95","v":"Jaar"}]
[null,null,null,null,{"$f":" E$9","v":"Jaar"},{"$f":" F$9","v":0},"Volgnr",0,0,0,1,2,3,4,5,6,7,8,9,10,11,12,13,14,15,16,17,18,19,20,21,22,23,24,25,26,27,28,29,30]
[null,null,null,null,"Economische levensduur Vlag",null,"Vlag",{"$f":" SUM(J20:AN20)","v":15},null,{"$f":" IF( AND( J19 >= $F18, J19 < ($F17 + $F18)), 1, 0)","v":0},{"$f":" IF( AND( K19 >= $F18, K19 < ($F17 + $F18)), 1, 0)","v":1},1,1,1,1,1,1,1,1,1,1,1,1,1,1,0,0,0,0,0,0,0,0,0,0,0,0,0,0,0]
[]
[null,"Vervangingsinvestering"]
[null,null,null,null,{"$f":" Input_Output!E$43","v":"Levensduur te vervangen onderdeel"},{"$f":" Input_Output!F$43","v":12},{"$f":" Input_Output!G$43","v":"Jaar"}]
[null,null,null,null,{"$f":" E$20","v":"Economische levensduur Vlag"},{"$f":" F$20","v":0},"Vlag",15,0,0,1,1,1,1,1,1,1,1,1,1,1,1,1,1,1,0,0,0,0,0,0,0,0,0,0,0,0,0,0,0]
[null,null,null,null,"Cumulatieve economische levensduur",null,"Volgnr",null,null,{"$f":" IF( J24 = 0, 0, I25 + J24)","v":0},1,2,3,4,5,6,7,8,9,10,11,12,13,14,15,0,0,0,0,0,0,0,0,0,0,0,0,0,0,0]
[null,null,null,null,"Vervangingsinvestering Vlag",null,"Vlag",null,null,{"$f":" IF( $F23 + 1 = J25, 1, 0)","v":0},0,0,0,0,0,0,0,0,0,0,0,0,1,0,0,0,0,0,0,0,0,0,0,0,0,0,0,0,0,0]
[]
[null,"Beleidsperiode"]
[null,null,null,null,{"$f":"Input_Output!E97","v":"Beleidsperiode"},{"$f":"Input_Output!F97","v":15},{"$f":"Input_Output!G97","v":"Jaar"}]
[null,null,null,null,{"$f":" Input_Output!E$95","v":"Constructieperiode"},{"$f":" Input_Output!F$95","v":1},{"$f":" Input_Output!G$95","v":"Jaar"}]
{"$rows_left_out":518}
{"sheet":"FinResBedr","index":4,"n_rows":95,"n_cols":40,"rows_kept":95,"cut":false,"hidden":false,"merged":[]}
[{"$f":"Input_Output!A1","v":"Onrendabele Topberekening"}]
[{"$f":"Input_Output!F3","v":"Fictieve voorbeeldberekening"}]
[null,null,null,null,null,null,null,null,null,"Jaar"]
[null,null,null,null,null,"Constante","Eenheid","Totaal",null,{"$f":" Calc!J$4","v":0},{"$f":" Calc!K$4","v":1},{"$f":" Calc!L$4","v":2},{"$f":" Calc!M$4","v":3},{"$f":" Calc!N$4","v":4},{"$f":" Calc!O$4","v":5},{"$f":" Calc!P$4","v":6},{"$f":" Calc!Q$4","v":7},{"$f":" Calc!R$4","v":8},{"$f":" Calc!S$4","v":9},{"$f":" Calc!T$4","v":10},{"$f":" Calc!U$4","v":11},{"$f":" Calc!V$4","v":12},{"$f":" Calc!W$4","v":13},{"$f":" Calc!X$4","v":14},{"$f":" Calc!Y$4","v":15},{"$f":" Calc!Z$4","v":16},{"$f":" Calc!AA$4","v":17},{"$f":" Calc!AB$4","v":18},{"$f":" Calc!AC$4","v":19},{"$f":" Calc!AD$4","v":20},{"$f":" Calc!AE$4","v":21},{"$f":" Calc!AF$4","v":22},{"$f":" Calc!AG$4","v":23},{"$f":" Calc!AH$4","v":24},{"$f":" Calc!AI$4","v":25},{"$f":" Calc!AJ$4","v":26},{"$f":" Calc!AK$4","v":27},{"$f":" Calc!AL$4","v":28},{"$f":" Calc!AM$4","v":29},{"$f":" Calc!AN$4","v":30}]
[]
["Onrendabele Top"]
[]
[null,null,null,null,"Basis voor berekening onrendabele top","GS","GS: groene stroom/WKB: warmtekrachtbesparing"]
[null,null,null,null,"Bedrijfsfinanciering of projectfinanciering?","PF","BF/PF"]
[]
[null,null,null,null,{"$f":"Calc!E531","v":"Tussenkomst Onrendabele Top per MWh"},{"$f":"Calc!F531","v":234.81225290023013},{"$f":"Calc!G531","v":"Euro/MWh"}]
[]
[null,null,null,null,{"$f":" Calc!E$527","v":"Check rendement Project na belastingen"},{"$f":" Calc!F$527","v":1},{"$f":" Calc!G$527","v":"Check"}]
[]
["Productie"]
[]
[null,null,null,null,{"$f":"Calc!E96","v":" Bruto elektriciteitsproductie"},{"$f":"Calc!F96","v":0},{"$f":"Calc!G96","v":"kWh"},{"$f":"Calc!H96","v":63750},{"$f":"Calc!I96","v":0},{"$f":"Calc!J96","v":0},{"$f":"Calc!K96","v":4250},{"$f":"Calc!L96","v":4250},{"$f":"Calc!M96","v":4250},{"$f":"Calc!N96","v":4250},{"$f":"Calc!O96","v":4250},{"$f":"Calc!P96","v":4250},{"$f":"Calc!Q96","v":4250},{"$f":"Calc!R96","v":4250},{"$f":"Calc!S96","v":4250},{"$f":"Calc!T96","v":4250},{"$f":"Calc!U96","v":4250},{"$f":"Calc!V96","v":4250},{"$f":"Calc!W96","v":4250},{"$f":"Calc!X96","v":4250},{"$f":"Calc!Y96","v":4250},{"$f":"Calc!Z96","v":0},{"$f":"Calc!AA96","v":0},{"$f":"Calc!AB96","v":0},{"$f":"Calc!AC96","v":0},{"$f":"Calc!AD96","v":0},{"$f":"Calc!AE96","v":0},{"$f":"Calc!AF96","v":0},{"$f":"Calc!AG96","v":0},{"$f":"Calc!AH96","v":0},{"$f":"Calc!AI96","v":0},{"$f":"Calc!AJ96","v":0},{"$f":"Calc!AK96","v":0},{"$f":"Calc!AL96","v":0},{"$f":"Calc!AM96","v":0},{"$f":"Calc!AN96","v":0}]
[null,null,null,null,{"$f":"Calc!E123","v":"WKK warmteproductie (equivalent aardgasvolume)"},{"$f":"Calc!F123","v":0},{"$f":"Calc!G123","v":"kWh"},{"$f":"Calc!H123","v":0},{"$f":"Calc!I123","v":0},{"$f":"Calc!J123","v":0},{"$f":"Calc!K123","v":0},{"$f":"Calc!L123","v":0},{"$f":"Calc!M123","v":0},{"$f":"Calc!N123","v":0},{"$f":"Calc!O123","v":0},{"$f":"Calc!P123","v":0},{"$f":"Calc!Q123","v":0},{"$f":"Calc!R123","v":0},{"$f":"Calc!S123","v":0},{"$f":"Calc!T123","v":0},{"$f":"Calc!U123","v":0},{"$f":"Calc!V123","v":0},{"$f":"Calc!W123","v":0},{"$f":"Calc!X123","v":0},{"$f":"Calc!Y123","v":0},{"$f":"Calc!Z123","v":0},{"$f":"Calc!AA123","v":0},{"$f":"Calc!AB123","v":0},{"$f":"Calc!AC123","v":0},{"$f":"Calc!AD123","v":0},{"$f":"Calc!AE123","v":0},{"$f":"Calc!AF123","v":0},{"$f":"Calc!AG123","v":0},{"$f":"Calc!AH123","v":0},{"$f":"Calc!AI123","v":0},{"$f":"Calc!AJ123","v":0},{"$f":"Calc!AK123","v":0},{"$f":"Calc!AL123","v":0},{"$f":"Calc!AM123","v":0},{"$f":"Calc!AN123","v":0}]
[null,null,null,null,{"$f":"Calc!E134","v":"Besparing primaire brandstof"},{"$f":"Calc!F134","v":0},{"$f":"Calc!G134","v":"kWh"},{"$f":"Calc!H134","v":0},{"$f":"Calc!I134","v":0},{"$f":"Calc!J134","v":0},{"$f":"Calc!K134","v":0},{"$f":"Calc!L134","v":0},{"$f":"Calc!M134","v":0},{"$f":"Calc!N134","v":0},{"$f":"Calc!O134","v":0},{"$f":"Calc!P134","v":0},{"$f":"Calc!Q134","v":0},{"$f":"Calc!R134","v":0},{"$f":"Calc!S134","v":0},{"$f":"Calc!T134","v":0},{"$f":"Calc!U134","v":0},{"$f":"Calc!V134","v":0},{"$f":"Calc!W134","v":0},{"$f":"Calc!X134","v":0},{"$f":"Calc!Y134","v":0},{"$f":"Calc!Z134","v":0},{"$f":"Calc!AA134","v":0},{"$f":"Calc!AB134","v":0},{"$f":"Calc!AC134","v":0},{"$f":"Calc!AD134","v":0},{"$f":"Calc!AE134","v":0},{"$f":"Calc!AF134","v":0},{"$f":"Calc!AG134","v":0},{"$f":"Calc!AH134","v":0},{"$f":"Calc!AI134","v":0},{"$f":"Calc!AJ134","v":0},{"$f":"Calc!AK134","v":0},{"$f":"Calc!AL134","v":0},{"$f":"Calc!AM134","v":0},{"$f":"Calc!AN134","v":0}]
[null,null,null,null,{"$f":" Calc!E161","v":"Valoriseerbare warmtekrachtbesparing"},{"$f":" Calc!F161","v":0},{"$f":" Calc!G161","v":"kWh"},{"$f":" Calc!H161","v":0},{"$f":" Calc!I161","v":0},{"$f":" Calc!J161","v":0},{"$f":" Calc!K161","v":0},{"$f":" Calc!L161","v":0},{"$f":" Calc!M161","v":0},{"$f":" Calc!N161","v":0},{"$f":" Calc!O161","v":0},{"$f":" Calc!P161","v":0},{"$f":" Calc!Q161","v":0},{"$f":" Calc!R161","v":0},{"$f":" Calc!S161","v":0},{"$f":" Calc!T161","v":0},{"$f":" Calc!U161","v":0},{"$f":" Calc!V161","v":0},{"$f":" Calc!W161","v":0},{"$f":" Calc!X161","v":0},{"$f":" Calc!Y161","v":0},{"$f":" Calc!Z161","v":0},{"$f":" Calc!AA161","v":0},{"$f":" Calc!AB161","v":0},{"$f":" Calc!AC161","v":0},{"$f":" Calc!AD161","v":0},{"$f":" Calc!AE161","v":0},{"$f":" Calc!AF161","v":0},{"$f":" Calc!AG161","v":0},{"$f":" Calc!AH161","v":0},{"$f":" Calc!AI161","v":0},{"$f":" Calc!AJ161","v":0},{"$f":" Calc!AK161","v":0},{"$f":" Calc!AL161","v":0},{"$f":" Calc!AM161","v":0},{"$f":" Calc!AN161","v":0}]
[]
[]
["Kasstroom"]
[]
[null,null,null,null,"Met/zonder tussenkomst onrendabele top?","met","met/zonder"]
[]
[null,"Investeringen"]
[null,null,null,null,{"$f":"Calc!E258","v":"Investering"},{"$f":"Calc!F258","v":0},{"$f":"Calc!G258","v":"Euro"},{"$f":"Calc!H258","v":-9000},{"$f":"Calc!I258","v":0},{"$f":"Calc!J258","v":-9000},{"$f":"Calc!K258","v":0},{"$f":"Calc!L258","v":0},{"$f":"Calc!M258","v":0},{"$f":"Calc!N258","v":0},{"$f":"Calc!O258","v":0},{"$f":"Calc!P258","v":0},{"$f":"Calc!Q258","v":0},{"$f":"Calc!R258","v":0},{"$f":"Calc!S258","v":0},{"$f":"Calc!T258","v":0},{"$f":"Calc!U258","v":0},{"$f":"Calc!V258","v":0},{"$f":"Calc!W258","v":0},{"$f":"Calc!X258","v":0},{"$f":"Calc!Y258","v":0},{"$f":"Calc!Z258","v":0},{"$f":"Calc!AA258","v":0},{"$f":"Calc!AB258","v":0},{"$f":"Calc!AC258","v":0},{"$f":"Calc!AD258","v":0},{"$f":"Calc!AE258","v":0},{"$f":"Calc!AF258","v":0},{"$f":"Calc!AG258","v":0},{"$f":"Calc!AH258","v":0},{"$f":"Calc!AI258","v":0},{"$f":"Calc!AJ258","v":0},{"$f":"Calc!AK258","v":0},{"$f":"Calc!AL258","v":0},{"$f":"Calc!AM258","v":0},{"$f":"Calc!AN258","v":0}]
[null,null,null,null,{"$f":"Calc!E301","v":"Investeringssteun"},{"$f":"Calc!F301","v":0},{"$f":"Calc!G301","v":"Euro"},{"$f":"Calc!H301","v":0},{"$f":"Calc!I301","v":0},{"$f":"Calc!J301","v":0},{"$f":"Calc!K301","v":0},{"$f":"Calc!L301","v":0},{"$f":"Calc!M301","v":0},{"$f":"Calc!N301","v":0},{"$f":"Calc!O301","v":0},{"$f":"Calc!P301","v":0},{"$f":"Calc!Q301","v":0},{"$f":"Calc!R301","v":0},{"$f":"Calc!S301","v":0},{"$f":"Calc!T301","v":0},{"$f":"Calc!U301","v":0},{"$f":"Calc!V301","v":0},{"$f":"Calc!W301","v":0},{"$f":"Calc!X301","v":0},{"$f":"Calc!Y301","v":0},{"$f":"Calc!Z301","v":0},{"$f":"Calc!AA301","v":0},{"$f":"Calc!AB301","v":0},{"$f":"Calc!AC301","v":0},{"$f":"Calc!AD301","v":0},{"$f":"Calc!AE301","v":0},{"$f":"Calc!AF301","v":0},{"$f":"Calc!AG301","v":0},{"$f":"Calc!AH301","v":0},{"$f":"Calc!AI301","v":0},{"$f":"Calc!AJ301","v":0},{"$f":"Calc!AK301","v":0},{"$f":"Calc!AL301","v":0},{"$f":"Calc!AM301","v":0},{"$f":"Calc!AN301","v":0}]
[null,null,null,null,"Kasstroom investeringen",null,"Euro",{"$f":"SUM(J30:AN30)","v":-9000},null,{"$f":"J28+J29","v":-9000},{"$f":"K28+K29","v":0},0,0,0,0,0,0,0,0,0,0,0,0,0,0,0,0,0,0,0,0,0,0,0,0,0,0,0,0,0]
{"$rows_left_out":65}